Reaction Details
TargetTransient receptor potential cation channel subfamily M member 8
LigandBDBM50036554
Substrate/Competitorn/a
Meas. Tech.ChEMBL_1432891 (CHEMBL3383304)
IC50 9.0±n/a nM
Citation Ohmi, MShishido, YInoue, TAndo, KFujiuchi, AYamada, AWatanabe, SKawamura, K Identification of a novel 2-pyridyl-benzensulfonamide derivative, RQ-00203078, as a selective and orally active TRPM8 antagonist. Bioorg Med Chem Lett24:5364-8 (2014) 
 
Transient receptor potential cation channel subfamily M member 8
Name:Transient receptor potential cation channel subfamily M member 8
Type:Enzyme
Mol. Mass.:127633.53
Organism:Rattus norvegicus (Rat)
Description:Q8R455
Residue:1104
BDBM50036554
NameBDBM50036554
Synonyms:CHEMBL3353609
TypeSmall organic molecule
Emp. Form.C20H13Cl2F3N2O4S
Mol. Mass.505.294
SMILESOC(=O)c1ccc(cc1)S(=O)(=O)N(Cc1ccc(cc1)C(F)(F)F)c1ncc(Cl)cc1Cl