Reaction Details
TargetC-X-C chemokine receptor type 2
LigandBDBM50036791
Substrate/Competitorn/a
Meas. Tech.ChEMBL_1434449 (CHEMBL3388266)
IC50<10000±n/a nM
Citation Lu, HYang, TXu, ZWren, PBZhang, YCai, XPatel, MDong, KZhang, QZhang, WGuan, XXiang, JElliott, JDLin, XRen, F 2-Aminopyrimidin-4(1H)-one as the novel bioisostere of urea: discovery of novel and potent CXCR2 antagonists. Bioorg Med Chem Lett24:5493-6 (2015) 
 
C-X-C chemokine receptor type 2
Name:C-X-C chemokine receptor type 2
Type:Protein
Mol. Mass.:40767.88
Organism:Homo sapiens (Human)
Description:P25025
Residue:360
BDBM50036791
NameBDBM50036791
Synonyms:CHEMBL3354832
TypeSmall organic molecule
Emp. Form.C14H16ClN3O4S
Mol. Mass.357.813
SMILESCC(C)S(=O)(=O)c1c(Cl)ccc(Nc2nc(=O)cc(C)[nH]2)c1O