Reaction Details
TargetTyrosine-protein kinase ITK/TSK
LigandBDBM50037066
Substrate/Competitorn/a
Meas. Tech.ChEMBL_1435180 (CHEMBL3389531)
Ki 0.270000±n/a nM
Citation Trani, GBarker, JJBromidge, SMBrookfield, FABurch, JDChen, YEigenbrot, CHeifetz, AIsmaili, MHJohnson, AKrülle, TMMacKinnon, CHMaghames, RMcEwan, PAMontalbetti, CAOrtwine, DFPérez-Fuertes, YVaidya, DGWang, XZarrin, AAPei, Z Design, synthesis and structure-activity relationships of a novel class of sulfonylpyridine inhibitors of Interleukin-2 inducible T-cell kinase (ITK). Bioorg Med Chem Lett24:5818-23 (2014) 
 
Tyrosine-protein kinase ITK/TSK
Name:Tyrosine-protein kinase ITK/TSK
Type:Protein
Mol. Mass.:71839.20
Organism:Homo sapiens (Human)
Description:Q08881
Residue:620
BDBM50037066
NameBDBM50037066
Synonyms:CHEMBL3355728
TypeSmall organic molecule
Emp. Form.C21H24N4O3S2
Mol. Mass.444.57
SMILESCc1cnc(Nc2cc(cc(N[C@H]3CC[C@H](O)CC3)n2)S(=O)(=O)c2ccccc2)s1