Reaction Details
TargetCarbonic anhydrase 9
LigandBDBM50037221
Substrate/Competitorn/a
Meas. Tech.ChEMBL_1436583 (CHEMBL3382963)
Ki 134±n/a nM
Citation SitaRam, naCeruso, MKhloya, PSupuran, CTSharma, PK 4-Functionalized 1,3-diarylpyrazoles bearing 6-aminosulfonylbenzothiazole moiety as potent inhibitors of carbonic anhydrase isoforms hCA I, II, IX and XII. Bioorg Med Chem22:6945-52 (2014) 
 
Carbonic anhydrase 9
Name:Carbonic anhydrase 9
Type:Enzyme
Mol. Mass.:49669.03
Organism:Homo sapiens (Human)
Description:Catalytic domain of human cloned isozyme was used in the assay
Residue:459
BDBM50037221
NameBDBM50037221
Synonyms:CHEMBL3356275
TypeSmall organic molecule
Emp. Form.C18H15N5O3S2
Mol. Mass.413.473
SMILESCc1ccc(cc1)-c1nn(cc1\C=N\O)-c1nc2ccc(cc2s1)S(N)(=O)=O