Reaction Details
TargetCarbonic anhydrase 9
LigandBDBM50037235
Substrate/Competitorn/a
Meas. Tech.ChEMBL_1436583 (CHEMBL3382963)
Ki 2.8±n/a nM
Citation SitaRam, naCeruso, MKhloya, PSupuran, CTSharma, PK 4-Functionalized 1,3-diarylpyrazoles bearing 6-aminosulfonylbenzothiazole moiety as potent inhibitors of carbonic anhydrase isoforms hCA I, II, IX and XII. Bioorg Med Chem22:6945-52 (2014) 
 
Carbonic anhydrase 9
Name:Carbonic anhydrase 9
Type:Enzyme
Mol. Mass.:49669.03
Organism:Homo sapiens (Human)
Description:Catalytic domain of human cloned isozyme was used in the assay
Residue:459
BDBM50037235
NameBDBM50037235
Synonyms:CHEMBL3356266
TypeSmall organic molecule
Emp. Form.C17H11ClN4O4S2
Mol. Mass.434.877
SMILESNS(=O)(=O)c1ccc2nc(sc2c1)-n1cc(C(O)=O)c(n1)-c1ccc(Cl)cc1