Reaction Details
TargetCarbonic anhydrase 2
LigandBDBM50037226
Substrate/Competitorn/a
Meas. Tech.ChEMBL_1436582 (CHEMBL3382962)
Ki 4821±n/a nM
Citation SitaRam, naCeruso, MKhloya, PSupuran, CTSharma, PK 4-Functionalized 1,3-diarylpyrazoles bearing 6-aminosulfonylbenzothiazole moiety as potent inhibitors of carbonic anhydrase isoforms hCA I, II, IX and XII. Bioorg Med Chem22:6945-52 (2014) 
 
Carbonic anhydrase 2
Name:Carbonic anhydrase 2
Type:Enzyme
Mol. Mass.:29250.71
Organism:Homo sapiens (Human)
Description:P00918
Residue:260
BDBM50037226
NameBDBM50037226
Synonyms:CHEMBL3356272
TypeSmall organic molecule
Emp. Form.C17H10ClN5O2S2
Mol. Mass.415.877
SMILESNS(=O)(=O)c1ccc2nc(sc2c1)-n1cc(C#N)c(n1)-c1ccc(Cl)cc1