Reaction Details
TargetCarbonic anhydrase 1
LigandBDBM50037243
Substrate/Competitorn/a
Meas. Tech.ChEMBL_1436581 (CHEMBL3382961)
Ki 157±n/a nM
Citation SitaRam, naCeruso, MKhloya, PSupuran, CTSharma, PK 4-Functionalized 1,3-diarylpyrazoles bearing 6-aminosulfonylbenzothiazole moiety as potent inhibitors of carbonic anhydrase isoforms hCA I, II, IX and XII. Bioorg Med Chem22:6945-52 (2014) 
 
Carbonic anhydrase 1
Name:Carbonic anhydrase 1
Type:Enzyme
Mol. Mass.:28873.37
Organism:Homo sapiens (Human)
Description:P00915
Residue:261
BDBM50037243
NameBDBM50037243
Synonyms:CHEMBL3356263
TypeSmall organic molecule
Emp. Form.C17H12N4O4S2
Mol. Mass.400.432
SMILESNS(=O)(=O)c1ccc2nc(sc2c1)-n1cc(C(O)=O)c(n1)-c1ccccc1