Reaction Details
TargetGenome polyprotein
LigandBDBM50037493
Substrate/Competitorn/a
Meas. Tech.ChEMBL_1437305 (CHEMBL3384808)
Ki 230±n/a nM
Citation Lampa, AAlogheli, HEhrenberg, AEÅkerblom, ESvensson, RArtursson, PDanielson, UHKarlén, ASandström, A Vinylated linear P2 pyrimidinyloxyphenylglycine based inhibitors of the HCV NS3/4A protease and corresponding macrocycles. Bioorg Med Chem22:6595-615 (2015) 
 
Genome polyprotein
Name:Genome polyprotein
Synonyms:Nonstructural protein NS3-4A
Type:PROTEIN
Mol. Mass.:71633.49
Organism:Hepatitis C virus
Description:ChEMBL_109716
Residue:674
BDBM50037493
NameBDBM50037493
Synonyms:CHEMBL3356707
TypeSmall organic molecule
Emp. Form.C45H54N6O9S
Mol. Mass.855.01
SMILESCOc1cc(Oc2ccc(cc2)[C@H](NC(=O)[C@H](CCCCCC=C)NC(=O)OC(C)(C)C)C(=O)Nc2ccccc2C(=O)NS(=O)(=O)CCCC=C)nc(n1)-c1ccccc1