Reaction Details
TargetGenome polyprotein
LigandBDBM50037494
Substrate/Competitorn/a
Meas. Tech.ChEMBL_1437305 (CHEMBL3384808)
Ki 110±n/a nM
Citation Lampa, AAlogheli, HEhrenberg, AEÅkerblom, ESvensson, RArtursson, PDanielson, UHKarlén, ASandström, A Vinylated linear P2 pyrimidinyloxyphenylglycine based inhibitors of the HCV NS3/4A protease and corresponding macrocycles. Bioorg Med Chem22:6595-615 (2015) 
 
Genome polyprotein
Name:Genome polyprotein
Synonyms:Nonstructural protein NS3-4A
Type:PROTEIN
Mol. Mass.:71633.49
Organism:Hepatitis C virus
Description:ChEMBL_109716
Residue:674
BDBM50037494
NameBDBM50037494
Synonyms:CHEMBL3356706
TypeSmall organic molecule
Emp. Form.C43H48N6O8S
Mol. Mass.808.942
SMILESCC(C)(C)[C@H](NC(=O)OCCC=C)C(=O)N[C@H](C(=O)Nc1ccccc1C(=O)NS(=O)(=O)CCCC=C)c1ccc(Oc2cc(C=C)nc(n2)-c2ccccc2)cc1