Reaction Details
TargetGenome polyprotein
LigandBDBM50037501
Substrate/Competitorn/a
Meas. Tech.ChEMBL_1437305 (CHEMBL3384808)
Ki 63±n/a nM
Citation Lampa, AAlogheli, HEhrenberg, AEÅkerblom, ESvensson, RArtursson, PDanielson, UHKarlén, ASandström, A Vinylated linear P2 pyrimidinyloxyphenylglycine based inhibitors of the HCV NS3/4A protease and corresponding macrocycles. Bioorg Med Chem22:6595-615 (2015) 
 
Genome polyprotein
Name:Genome polyprotein
Synonyms:Nonstructural protein NS3-4A
Type:PROTEIN
Mol. Mass.:71633.49
Organism:Hepatitis C virus
Description:ChEMBL_109716
Residue:674
BDBM50037501
NameBDBM50037501
Synonyms:CHEMBL1170408
TypeSmall organic molecule
Emp. Form.C47H59N5O9S
Mol. Mass.870.064
SMILESCCC[C@H](NC(=O)[C@@H](NC(=O)[C@@H](NC(=O)OC(C)(C)C)C(C)(C)C)c1ccc(Oc2cc(nc3cc(OC)ccc23)-c2ccccc2)c(C=C)c1)C(=O)NS(=O)(=O)CCCC=C