Reaction Details
TargetNeuraminidase
LigandBDBM4994
Substrate/Competitorn/a
Meas. Tech.ChEMBL_1438031 (CHEMBL3387278)
IC50 1.8±n/a nM
Citation Hong, BTChen, CLFang, JMTsai, KCWang, SYHuang, WICheng, YSWong, CH Oseltamivir hydroxamate and acyl sulfonamide derivatives as influenza neuraminidase inhibitors. Bioorg Med Chem22:6647-54 (2015) 
 
Neuraminidase
Name:Neuraminidase
Type:PROTEIN
Mol. Mass.:51863.92
Organism:Influenza A virus (strain A/USSR/90/1977 H1N1)
Description:ChEMBL_109720
Residue:470
BDBM4994
NameBDBM4994
Synonyms:(3R,4R,5S)-5-amino-4-acetamido-3-(pentan-3-yloxy)cyclohex-1-ene-1-carboxylic acid GS4071 | Oseltamivir carboxylate
TypeSmall organic molecule
Emp. Form.C14H24N2O4
Mol. Mass.284.3514
SMILESCCC(CC)O[C@@H]1C=C(C[C@H](N)[C@H]1NC(C)=O)C(O)=O