Reaction Details
TargetGlutamate receptor ionotropic, NMDA 2B
LigandBDBM50083351
Substrate/Competitorn/a
Meas. Tech.ChEMBL_1438829 (CHEMBL3390297)
Ki 10.0±n/a nM
Citation Gawaskar, SSchepmann, DBonifazi, AWünsch, B Synthesis, GluN2B affinity and selectivity of benzo[7]annulen-7-amines. Bioorg Med Chem22:6638-46 (2015) 
 
Glutamate receptor ionotropic, NMDA 2B
Name:Glutamate receptor ionotropic, NMDA 2B
Type:PROTEIN
Mol. Mass.:166375.46
Organism:Homo sapiens (Human)
Description:ChEMBL_1438829
Residue:1484
BDBM50083351
NameBDBM50083351
Synonyms:(+/-)-[2-(4-benzylpiperidino)-1-(4-hydroxyphenyl)-1-propanol] 4-(2-(4-benzylpiperidin-1-yl)-1-hydroxypropyl)phenol CHEMBL305187 IFENPRODIL
TypeSmall organic molecule
Emp. Form.C21H27NO2
Mol. Mass.325.4446
SMILESCC(C(O)c1ccc(O)cc1)N1CCC(Cc2ccccc2)CC1