Reaction Details
TargetSigma non-opioid intracellular receptor 1
LigandBDBM50037707
Substrate/Competitorn/a
Meas. Tech.ChEMBL_1438832 (CHEMBL3390300)
Ki 20±n/a nM
Citation Gawaskar, SSchepmann, DBonifazi, AWünsch, B Synthesis, GluN2B affinity and selectivity of benzo[7]annulen-7-amines. Bioorg Med Chem22:6638-46 (2015) 
 
Sigma non-opioid intracellular receptor 1
Name:Sigma non-opioid intracellular receptor 1
Type:Protein
Mol. Mass.:25307.17
Organism:Cavia porcellus (Guinea pig)
Description:Q60492
Residue:223
BDBM50037707
NameBDBM50037707
Synonyms:CHEMBL3357792
TypeSmall organic molecule
Emp. Form.C23H29N
Mol. Mass.319.4831
SMILESC1C[C@@H](CC[C@H]1NC1CCc2ccccc2CC1)c1ccccc1