Reaction Details
TargetSigma non-opioid intracellular receptor 1
LigandBDBM50037703
Substrate/Competitorn/a
Meas. Tech.ChEMBL_1438832 (CHEMBL3390300)
Ki 22±n/a nM
Citation Gawaskar, SSchepmann, DBonifazi, AWünsch, B Synthesis, GluN2B affinity and selectivity of benzo[7]annulen-7-amines. Bioorg Med Chem22:6638-46 (2015) 
 
Sigma non-opioid intracellular receptor 1
Name:Sigma non-opioid intracellular receptor 1
Type:Protein
Mol. Mass.:25307.17
Organism:Cavia porcellus (Guinea pig)
Description:Q60492
Residue:223
BDBM50037703
NameBDBM50037703
Synonyms:CHEMBL3357788
TypeSmall organic molecule
Emp. Form.C22H27N
Mol. Mass.305.4565
SMILESC1CN(CCC1c1ccccc1)C1CCc2ccccc2CC1