Reaction Details
TargetGlutamate receptor ionotropic, NMDA 2B
LigandBDBM50037708
Substrate/Competitorn/a
Meas. Tech.ChEMBL_1438829 (CHEMBL3390297)
Ki 16±n/a nM
Citation Gawaskar, SSchepmann, DBonifazi, AWünsch, B Synthesis, GluN2B affinity and selectivity of benzo[7]annulen-7-amines. Bioorg Med Chem22:6638-46 (2015) 
 
Glutamate receptor ionotropic, NMDA 2B
Name:Glutamate receptor ionotropic, NMDA 2B
Type:PROTEIN
Mol. Mass.:166375.46
Organism:Homo sapiens (Human)
Description:ChEMBL_1438829
Residue:1484
BDBM50037708
NameBDBM50037708
Synonyms:CHEMBL3357783
TypeSmall organic molecule
Emp. Form.C21H27NO2
Mol. Mass.325.4446
SMILESCOc1ccc2C(O)CC(CCc2c1)NCCCc1ccccc1