Reaction Details
TargetGlutamate receptor ionotropic, NMDA 2B
LigandBDBM50037710
Substrate/Competitorn/a
Meas. Tech.ChEMBL_1438829 (CHEMBL3390297)
Ki 57±n/a nM
Citation Gawaskar, SSchepmann, DBonifazi, AWünsch, B Synthesis, GluN2B affinity and selectivity of benzo[7]annulen-7-amines. Bioorg Med Chem22:6638-46 (2015) 
 
Glutamate receptor ionotropic, NMDA 2B
Name:Glutamate receptor ionotropic, NMDA 2B
Type:PROTEIN
Mol. Mass.:166375.46
Organism:Homo sapiens (Human)
Description:ChEMBL_1438829
Residue:1484
BDBM50037710
NameBDBM50037710
Synonyms:CHEMBL3357785
TypeSmall organic molecule
Emp. Form.C18H21N
Mol. Mass.251.366
SMILESC(NC1CCc2ccccc2CC1)c1ccccc1