Reaction Details
TargetGlutamate receptor ionotropic, NMDA 2B
LigandBDBM50037711
Substrate/Competitorn/a
Meas. Tech.ChEMBL_1438829 (CHEMBL3390297)
Ki 20±n/a nM
Citation Gawaskar, SSchepmann, DBonifazi, AWünsch, B Synthesis, GluN2B affinity and selectivity of benzo[7]annulen-7-amines. Bioorg Med Chem22:6638-46 (2015) 
 
Glutamate receptor ionotropic, NMDA 2B
Name:Glutamate receptor ionotropic, NMDA 2B
Type:PROTEIN
Mol. Mass.:166375.46
Organism:Homo sapiens (Human)
Description:ChEMBL_1438829
Residue:1484
BDBM50037711
NameBDBM50037711
Synonyms:CHEMBL3357786
TypeSmall organic molecule
Emp. Form.C19H23N
Mol. Mass.265.3926
SMILESC(Cc1ccccc1)NC1CCc2ccccc2CC1