Reaction Details
TargetKinesin-like protein KIFC1
LigandBDBM50037966
Substrate/Competitorn/a
Meas. Tech.ChEMBL_1438848 (CHEMBL3390316)
IC50 500±n/a nM
Citation Yang, BLamb, MLZhang, THennessy, EJGrewal, GSha, LZambrowski, MBlock, MHDowling, JESu, NWu, JDeegan, TMikule, KWang, WKaspera, RChuaqui, CChen, H Discovery of potent KIFC1 inhibitors using a method of integrated high-throughput synthesis and screening. J Med Chem57:9958-70 (2014) 
 
Kinesin-like protein KIFC1
Name:Kinesin-like protein KIFC1
Type:PROTEIN
Mol. Mass.:73763.89
Organism:Homo sapiens (Human)
Description:ChEMBL_109524
Residue:673
BDBM50037966
NameBDBM50037966
Synonyms:CHEMBL3358271
TypeSmall organic molecule
Emp. Form.C28H33F3N4O3S
Mol. Mass.562.647
SMILESCCCc1cc(sc1C)C(=O)N[C@H](Cc1ccc(nc1)-c1cccc(OC(F)(F)F)c1)C(=O)NCCN(C)C