Reaction Details
TargetKinesin-like protein KIFC1
LigandBDBM50037897
Substrate/Competitorn/a
Meas. Tech.ChEMBL_1438848 (CHEMBL3390316)
IC50 1900±n/a nM
Citation Yang, BLamb, MLZhang, THennessy, EJGrewal, GSha, LZambrowski, MBlock, MHDowling, JESu, NWu, JDeegan, TMikule, KWang, WKaspera, RChuaqui, CChen, H Discovery of potent KIFC1 inhibitors using a method of integrated high-throughput synthesis and screening. J Med Chem57:9958-70 (2014) 
 
Kinesin-like protein KIFC1
Name:Kinesin-like protein KIFC1
Type:PROTEIN
Mol. Mass.:73763.89
Organism:Homo sapiens (Human)
Description:ChEMBL_109524
Residue:673
BDBM50037897
NameBDBM50037897
Synonyms:CHEMBL3358257
TypeSmall organic molecule
Emp. Form.C30H34F3N3O4
Mol. Mass.557.6039
SMILESCOCc1cc(ccc1OC)C(=O)NC(Cc1ccc(cc1)-c1cccc(c1)C(F)(F)F)C(=O)NCCN(C)C