Reaction Details
TargetAdenosine receptor A1
LigandBDBM50038025
Substrate/Competitorn/a
Meas. Tech.ChEMBL_1439617 (CHEMBL3383135)
Ki 2.4±n/a nM
Citation Giovannoni, MPCiciani, GCilibrizzi, ACrocetti, LDaniele, SDi Cesare Mannelli, LGhelardini, CGiacomelli, CGuerrini, GMartini, CTrincavelli, MLVergelli, C Further studies on pyrazolo[1',5':1,6]pyrimido[4,5-d]pyridazin-4(3H)-ones as potent and selective human A1 adenosine receptor antagonists. Eur J Med Chem89:32-41 (2014) 
 
Adenosine receptor A1
Name:Adenosine receptor A1
Type:G Protein-Coupled Receptor (GPCR)
Mol. Mass.:36520.92
Organism:Homo sapiens (Human)
Description:P30542
Residue:326
BDBM50038025
NameBDBM50038025
Synonyms:CHEMBL3359421
TypeSmall organic molecule
Emp. Form.C25H21N5S
Mol. Mass.423.533
SMILESS=c1n(Cc2ccccc2)nc(C2CCC2)c2c3cc(nn3cnc12)-c1ccccc1