Reaction Details
TargetAdenosine receptor A1
LigandBDBM50038029
Substrate/Competitorn/a
Meas. Tech.ChEMBL_1439617 (CHEMBL3383135)
Ki 3.4±n/a nM
Citation Giovannoni, MPCiciani, GCilibrizzi, ACrocetti, LDaniele, SDi Cesare Mannelli, LGhelardini, CGiacomelli, CGuerrini, GMartini, CTrincavelli, MLVergelli, C Further studies on pyrazolo[1',5':1,6]pyrimido[4,5-d]pyridazin-4(3H)-ones as potent and selective human A1 adenosine receptor antagonists. Eur J Med Chem89:32-41 (2014) 
 
Adenosine receptor A1
Name:Adenosine receptor A1
Type:G Protein-Coupled Receptor (GPCR)
Mol. Mass.:36520.92
Organism:Homo sapiens (Human)
Description:P30542
Residue:326
BDBM50038029
NameBDBM50038029
Synonyms:CHEMBL3359413
TypeSmall organic molecule
Emp. Form.C26H23N5O
Mol. Mass.421.4937
SMILESCc1nc2c(c(nn(Cc3ccccc3)c2=O)C2CCC2)c2cc(nn12)-c1ccccc1