Reaction Details
TargetSteroid 17-alpha-hydroxylase/17,20 lyase
LigandBDBM31768
Substrate/Competitorn/a
Meas. Tech.ChEMBL_1440365 (CHEMBL3385627)
IC50 4500±n/a nM
Citation Stefanachi, AHanke, NPisani, LLeonetti, FNicolotti, OCatto, MCellamare, SHartmann, RWCarotti, A Discovery of new 7-substituted-4-imidazolylmethyl coumarins and 4'-substituted-2-imidazolyl acetophenones open analogues as potent and selective inhibitors of steroid-11ß-hydroxylase. Eur J Med Chem89:106-14 (2014) 
 
Steroid 17-alpha-hydroxylase/17,20 lyase
Name:Steroid 17-alpha-hydroxylase/17,20 lyase
Type:Enzyme
Mol. Mass.:57382.42
Organism:Homo sapiens (Human)
Description:E.coli expressing human CYP17
Residue:508
BDBM31768
NameBDBM31768
Synonyms:CHEMBL295698 Nizoral | Panfungol
TypeSmall organic molecule
Emp. Form.C26H28Cl2N4O4
Mol. Mass.531.431
SMILESCC(=O)N1CCN(CC1)c1ccc(OC[C@@H]2CO[C@](Cn3ccnc3)(O2)c2ccc(Cl)cc2Cl)cc1