Reaction Details
TargetInsulin-like growth factor 1 receptor
LigandBDBM50038423
Substrate/Competitorn/a
Meas. Tech.ChEMBL_1441972 (CHEMBL3372238)
IC50 100000±n/a nM
Citation Xie, FZhu, HZhang, HLang, QTang, LHuang, QYu, L In vitro and in vivo characterization of a benzofuran derivative, a potential anticancer agent, as a novel Aurora B kinase inhibitor. Eur J Med Chem89:310-9 (2014) 
 
Insulin-like growth factor 1 receptor
Name:Insulin-like growth factor 1 receptor
Type:Protein
Mol. Mass.:154776.79
Organism:Homo sapiens (Human)
Description:P08069
Residue:1367
BDBM50038423
NameBDBM50038423
Synonyms:CHEMBL3361128
TypeSmall organic molecule
Emp. Form.C15H10O4
Mol. Mass.254.2375
SMILESOc1ccc(\C=C2\Oc3ccccc3C2=O)cc1O