Reaction Details
TargetCasein kinase I isoform alpha
LigandBDBM50038423
Substrate/Competitorn/a
Meas. Tech.ChEMBL_1441970 (CHEMBL3372236)
IC50 78800±n/a nM
Citation Xie, FZhu, HZhang, HLang, QTang, LHuang, QYu, L In vitro and in vivo characterization of a benzofuran derivative, a potential anticancer agent, as a novel Aurora B kinase inhibitor. Eur J Med Chem89:310-9 (2014) 
 
Casein kinase I isoform alpha
Name:Casein kinase I isoform alpha
Type:Serine/threonine-protein kinase
Mol. Mass.:38936.59
Organism:Homo sapiens (Human)
Description:P48729
Residue:337
BDBM50038423
NameBDBM50038423
Synonyms:CHEMBL3361128
TypeSmall organic molecule
Emp. Form.C15H10O4
Mol. Mass.254.2375
SMILESOc1ccc(\C=C2\Oc3ccccc3C2=O)cc1O