Reaction Details
TargetCannabinoid receptor 2
LigandBDBM50039545
Substrate/Competitorn/a
Meas. Tech.ChEMBL_1445413 (CHEMBL3379646)
EC50 4.3±n/a nM
Citation Guidetti, RAstles, PCSanderson, AJHollinshead, SPJohnson, MPChambers, MG The SAR development of substituted purine derivatives as selective CB2 agonists for the treatment of chronic pain. Bioorg Med Chem Lett24:5572-5 (2014) 
 
Cannabinoid receptor 2
Name:Cannabinoid receptor 2
Type:G Protein-Coupled Receptor (GPCR)
Mol. Mass.:39690.94
Organism:Homo sapiens (Human)
Description:P34972
Residue:360
BDBM50039545
NameBDBM50039545
Synonyms:CHEMBL3357337
TypeSmall organic molecule
Emp. Form.C22H29ClN6O
Mol. Mass.428.958
SMILESCCN1CCN(CC1)c1nc(C)nc2n(CCCOC)c(nc12)-c1ccccc1Cl