Reaction Details
TargetCannabinoid receptor 1
LigandBDBM50039629
Substrate/Competitorn/a
Meas. Tech.ChEMBL_1445415 (CHEMBL3379648)
EC50>100000±n/a nM
Citation Guidetti, RAstles, PCSanderson, AJHollinshead, SPJohnson, MPChambers, MG The SAR development of substituted purine derivatives as selective CB2 agonists for the treatment of chronic pain. Bioorg Med Chem Lett24:5572-5 (2014) 
 
Cannabinoid receptor 1
Name:Cannabinoid receptor 1
Type:G Protein-Coupled Receptor (GPCR)
Mol. Mass.:52868.96
Organism:Homo sapiens (Human)
Description:P21554
Residue:472
BDBM50039629
NameBDBM50039629
Synonyms:CHEMBL3357340
TypeSmall organic molecule
Emp. Form.C20H25ClN6O
Mol. Mass.400.905
SMILESC[C@@H](CO)n1c(nc2c(nc(C)nc12)N1CCN(C)CC1)-c1ccccc1Cl