Reaction Details
TargetCannabinoid receptor 1
LigandBDBM50006250
Substrate/Competitorn/a
Meas. Tech.ChEMBL_1445415 (CHEMBL3379648)
EC50>100000±n/a nM
Citation Guidetti, RAstles, PCSanderson, AJHollinshead, SPJohnson, MPChambers, MG The SAR development of substituted purine derivatives as selective CB2 agonists for the treatment of chronic pain. Bioorg Med Chem Lett24:5572-5 (2014) 
 
Cannabinoid receptor 1
Name:Cannabinoid receptor 1
Type:G Protein-Coupled Receptor (GPCR)
Mol. Mass.:52868.96
Organism:Homo sapiens (Human)
Description:P21554
Residue:472
BDBM50006250
NameBDBM50006250
Synonyms:CHEMBL3139186
TypeSmall organic molecule
Emp. Form.C22H27ClN6O
Mol. Mass.426.942
SMILESCN1CCN(CC1)c1nc(C)nc2n(C3CCOCC3)c(nc12)-c1ccccc1Cl