Reaction Details
TargetSigma non-opioid intracellular receptor 1
LigandBDBM50068452
Substrate/Competitorn/a
Meas. Tech.ChEMBL_1443747 (CHEMBL3371720)
Ki 2.2±n/a nM
Citation Xu, RLord, SAPeterson, RMFergason-Cantrell, EALever, JRLever, SZ Ether modifications to 1-[2-(3,4-dimethoxyphenyl)ethyl]-4-(3-phenylpropyl)piperazine (SA4503): effects on binding affinity and selectivity for sigma receptors and monoamine transporters. Bioorg Med Chem23:222-30 (2014) 
 
Sigma non-opioid intracellular receptor 1
Name:Sigma non-opioid intracellular receptor 1
Type:Protein
Mol. Mass.:25307.17
Organism:Cavia porcellus (Guinea pig)
Description:Q60492
Residue:223
BDBM50068452
NameBDBM50068452
Synonyms:1-[2-(3,4-Dichloro-phenyl)-ethyl]-4-(3-phenyl-propyl)-piperazine | CHEMBL343654
TypeSmall organic molecule
Emp. Form.C21H26Cl2N2
Mol. Mass.377.351
SMILESClc1ccc(CCN2CCN(CCCc3ccccc3)CC2)cc1Cl