Reaction Details
TargetCaspase-7
LigandBDBM10246
Substrate/Competitorn/a
Meas. Tech.ChEMBL_1443756 (CHEMBL3371729)
IC50 155±n/a nM
Citation Li, ZPan, YZhong, WZhu, YZhao, YLi, LLiu, WZhou, HYang, C Synthesis and evaluation of N-acyl-substituted 1,2-benzisothiazol-3-one derivatives as caspase-3 inhibitors. Bioorg Med Chem22:6735-45 (2015) 
 
Caspase-7
Name:Caspase-7
Type:Enzyme
Mol. Mass.:34273.91
Organism:Homo sapiens (Human)
Description:P55210
Residue:303
BDBM10246
NameBDBM10246
Synonyms:(4S)-4-{[(1S)-1-{[(2S)-1-carboxy-3-oxopropan-2-yl]carbamoyl}-2-methylpropyl]carbamoyl}-4-[(3S)-3-acetamido-3-formamidopropanoic acid]butanoic acid CHEMBL417149
TypeSmall organic molecule
Emp. Form.C20H30N4O11
Mol. Mass.502.4724
SMILESCC(C)[C@H](NC(=O)[C@H](CCC(O)=O)NC(=O)[C@H](CC(O)=O)NC(C)=O)C(=O)N[C@@H](CC(O)=O)C=O