Reaction Details
TargetCarbonic anhydrase 2
LigandBDBM50040425
Substrate/Competitorn/a
Meas. Tech.ChEMBL_1443932 (CHEMBL3374772)
Ki 6.1±n/a nM
Citation Ceruso, MAntel, SVullo, DScozzafava, ASupuran, CT Inhibition studies of new ureido-substituted sulfonamides incorporating a GABA moiety against human carbonic anhydrase isoforms I-XIV. Bioorg Med Chem22:6768-75 (2015) 
 
Carbonic anhydrase 2
Name:Carbonic anhydrase 2
Type:Enzyme
Mol. Mass.:29250.71
Organism:Homo sapiens (Human)
Description:P00918
Residue:260
BDBM50040425
NameBDBM50040425
Synonyms:CHEMBL3360588
TypeSmall organic molecule
Emp. Form.C19H24N4O4S
Mol. Mass.404.483
SMILESNS(=O)(=O)c1ccc(CNC(=O)CCCNC(=O)NCc2ccccc2)cc1