Reaction Details
TargetCarbonic anhydrase 1
LigandBDBM50040428
Substrate/Competitorn/a
Meas. Tech.ChEMBL_1443931 (CHEMBL3374771)
Ki 42±n/a nM
Citation Ceruso, MAntel, SVullo, DScozzafava, ASupuran, CT Inhibition studies of new ureido-substituted sulfonamides incorporating a GABA moiety against human carbonic anhydrase isoforms I-XIV. Bioorg Med Chem22:6768-75 (2015) 
 
Carbonic anhydrase 1
Name:Carbonic anhydrase 1
Type:Enzyme
Mol. Mass.:28873.37
Organism:Homo sapiens (Human)
Description:P00915
Residue:261
BDBM50040428
NameBDBM50040428
Synonyms:CHEMBL3360591
TypeSmall organic molecule
Emp. Form.C19H23N5O6S
Mol. Mass.449.481
SMILESNS(=O)(=O)c1ccc(CCNC(=O)CCCNC(=O)Nc2ccc(cc2)[N+]([O-])=O)cc1