Reaction Details
TargetCarbonic anhydrase 1
LigandBDBM50040427
Substrate/Competitorn/a
Meas. Tech.ChEMBL_1443931 (CHEMBL3374771)
Ki 373±n/a nM
Citation Ceruso, MAntel, SVullo, DScozzafava, ASupuran, CT Inhibition studies of new ureido-substituted sulfonamides incorporating a GABA moiety against human carbonic anhydrase isoforms I-XIV. Bioorg Med Chem22:6768-75 (2015) 
 
Carbonic anhydrase 1
Name:Carbonic anhydrase 1
Type:Enzyme
Mol. Mass.:28873.37
Organism:Homo sapiens (Human)
Description:P00915
Residue:261
BDBM50040427
NameBDBM50040427
Synonyms:CHEMBL3360586
TypeSmall organic molecule
Emp. Form.C18H22N4O4S
Mol. Mass.390.457
SMILESNS(=O)(=O)c1ccc(CNC(=O)CCCNC(=O)Nc2ccccc2)cc1