Reaction Details
TargetCarbonic anhydrase 4
LigandBDBM50040425
Substrate/Competitorn/a
Meas. Tech.ChEMBL_1443934 (CHEMBL3374774)
Ki 880±n/a nM
Citation Ceruso, MAntel, SVullo, DScozzafava, ASupuran, CT Inhibition studies of new ureido-substituted sulfonamides incorporating a GABA moiety against human carbonic anhydrase isoforms I-XIV. Bioorg Med Chem22:6768-75 (2015) 
 
Carbonic anhydrase 4
Name:Carbonic anhydrase 4
Type:Enzyme
Mol. Mass.:35037.98
Organism:Homo sapiens (Human)
Description:P22748
Residue:312
BDBM50040425
NameBDBM50040425
Synonyms:CHEMBL3360588
TypeSmall organic molecule
Emp. Form.C19H24N4O4S
Mol. Mass.404.483
SMILESNS(=O)(=O)c1ccc(CNC(=O)CCCNC(=O)NCc2ccccc2)cc1