Reaction Details
TargetCarbonic anhydrase 5A, mitochondrial
LigandBDBM50040427
Substrate/Competitorn/a
Meas. Tech.ChEMBL_1443935 (CHEMBL3374775)
Ki 156±n/a nM
Citation Ceruso, MAntel, SVullo, DScozzafava, ASupuran, CT Inhibition studies of new ureido-substituted sulfonamides incorporating a GABA moiety against human carbonic anhydrase isoforms I-XIV. Bioorg Med Chem22:6768-75 (2015) 
 
Carbonic anhydrase 5A, mitochondrial
Name:Carbonic anhydrase 5A, mitochondrial
Type:Enzyme
Mol. Mass.:34755.54
Organism:Homo sapiens (Human)
Description:Human (cloned) isozyme
Residue:305
BDBM50040427
NameBDBM50040427
Synonyms:CHEMBL3360586
TypeSmall organic molecule
Emp. Form.C18H22N4O4S
Mol. Mass.390.457
SMILESNS(=O)(=O)c1ccc(CNC(=O)CCCNC(=O)Nc2ccccc2)cc1