Reaction Details
TargetCarbonic anhydrase 6
LigandBDBM50040426
Substrate/Competitorn/a
Meas. Tech.ChEMBL_1443936 (CHEMBL3374776)
Ki>120±n/a nM
Citation Ceruso, MAntel, SVullo, DScozzafava, ASupuran, CT Inhibition studies of new ureido-substituted sulfonamides incorporating a GABA moiety against human carbonic anhydrase isoforms I-XIV. Bioorg Med Chem22:6768-75 (2015) 
 
Carbonic anhydrase 6
Name:Carbonic anhydrase 6
Type:Enzyme
Mol. Mass.:35371.40
Organism:Homo sapiens (Human)
Description:P23280
Residue:308
BDBM50040426
NameBDBM50040426
Synonyms:CHEMBL3360587
TypeSmall organic molecule
Emp. Form.C19H24N4O4S
Mol. Mass.404.483
SMILESNS(=O)(=O)c1ccc(CCNC(=O)CCCNC(=O)Nc2ccccc2)cc1