Reaction Details
TargetCarbonic anhydrase 7
LigandBDBM50040428
Substrate/Competitorn/a
Meas. Tech.ChEMBL_1443937 (CHEMBL3374777)
Ki 18±n/a nM
Citation Ceruso, MAntel, SVullo, DScozzafava, ASupuran, CT Inhibition studies of new ureido-substituted sulfonamides incorporating a GABA moiety against human carbonic anhydrase isoforms I-XIV. Bioorg Med Chem22:6768-75 (2015) 
 
Carbonic anhydrase 7
Name:Carbonic anhydrase 7
Type:Enzyme
Mol. Mass.:29664.11
Organism:Homo sapiens (Human)
Description:Human cloned isozyme.
Residue:264
BDBM50040428
NameBDBM50040428
Synonyms:CHEMBL3360591
TypeSmall organic molecule
Emp. Form.C19H23N5O6S
Mol. Mass.449.481
SMILESNS(=O)(=O)c1ccc(CCNC(=O)CCCNC(=O)Nc2ccc(cc2)[N+]([O-])=O)cc1