Reaction Details
TargetCarbonic anhydrase 14
LigandBDBM50040429
Substrate/Competitorn/a
Meas. Tech.ChEMBL_1443941 (CHEMBL3374781)
Ki 48±n/a nM
Citation Ceruso, MAntel, SVullo, DScozzafava, ASupuran, CT Inhibition studies of new ureido-substituted sulfonamides incorporating a GABA moiety against human carbonic anhydrase isoforms I-XIV. Bioorg Med Chem22:6768-75 (2015) 
 
Carbonic anhydrase 14
Name:Carbonic anhydrase 14
Type:Enzyme
Mol. Mass.:37665.67
Organism:Homo sapiens (Human)
Description:Human (cloned) isozyme.
Residue:337
BDBM50040429
NameBDBM50040429
Synonyms:CHEMBL3360590
TypeSmall organic molecule
Emp. Form.C20H26N4O4S
Mol. Mass.418.51
SMILESNS(=O)(=O)c1ccc(CNC(=O)CCCNC(=O)NCCc2ccccc2)cc1