Reaction Details
TargetInterleukin-1 receptor-associated kinase 1
LigandBDBM50040727
Substrate/Competitorn/a
Meas. Tech.ChEMBL_1444382 (CHEMBL3372373)
IC50 983±n/a nM
Citation Chaudhary, DRobinson, SRomero, DL Recent advances in the discovery of small molecule inhibitors of interleukin-1 receptor-associated kinase 4 (IRAK4) as a therapeutic target for inflammation and oncology disorders. J Med Chem58:96-110 (2015) 
 
Interleukin-1 receptor-associated kinase 1
Name:Interleukin-1 receptor-associated kinase 1
Type:Enzyme
Mol. Mass.:76536.81
Organism:Homo sapiens (Human)
Description:P51617
Residue:712
BDBM50040727
NameBDBM50040727
Synonyms:CHEMBL3353220 | US9255110, 7
TypeSmall organic molecule
Emp. Form.C20H20N6O2S
Mol. Mass.408.477
SMILESCOc1cc2ncccc2cc1NC(=O)c1csc2cnc(nc12)N(C)CCN