Reaction Details
TargetInterleukin-1 receptor-associated kinase 4
LigandBDBM50040730
Substrate/Competitorn/a
Meas. Tech.ChEMBL_1444380 (CHEMBL3372371)
IC50<100±n/a nM
Citation Chaudhary, DRobinson, SRomero, DL Recent advances in the discovery of small molecule inhibitors of interleukin-1 receptor-associated kinase 4 (IRAK4) as a therapeutic target for inflammation and oncology disorders. J Med Chem58:96-110 (2015) 
 
Interleukin-1 receptor-associated kinase 4
Name:Interleukin-1 receptor-associated kinase 4
Type:Protein
Mol. Mass.:51519.08
Organism:Homo sapiens (Human)
Description:Q9NWZ3
Residue:460
BDBM50040730
NameBDBM50040730
Synonyms:CHEMBL3353212
TypeSmall organic molecule
Emp. Form.C24H25N7O
Mol. Mass.427.5016
SMILESCC(=O)N1CCC[C@H](C1)n1cc(cn1)-c1cnc(nc1)-c1cccc(c1)-c1cnn(C)c1