Reaction Details
TargetInterleukin-1 receptor-associated kinase 4
LigandBDBM50040732
Substrate/Competitorn/a
Meas. Tech.ChEMBL_1444378 (CHEMBL3372369)
IC50<100±n/a nM
Citation Chaudhary, DRobinson, SRomero, DL Recent advances in the discovery of small molecule inhibitors of interleukin-1 receptor-associated kinase 4 (IRAK4) as a therapeutic target for inflammation and oncology disorders. J Med Chem58:96-110 (2015) 
 
Interleukin-1 receptor-associated kinase 4
Name:Interleukin-1 receptor-associated kinase 4
Type:Protein
Mol. Mass.:51519.08
Organism:Homo sapiens (Human)
Description:Q9NWZ3
Residue:460
BDBM50040732
NameBDBM50040732
Synonyms:CHEMBL3353216 | US10064861, Compound 14
TypeSmall organic molecule
Emp. Form.C24H19N7O2
Mol. Mass.437.4534
SMILESO=C1Nc2nc3ccccc3n2CCn2cc(cn2)-c2ccc(=O)n(Cc3cccc1c3)n2