Reaction Details
TargetInterleukin-1 receptor-associated kinase 4
LigandBDBM50040789
Substrate/Competitorn/a
Meas. Tech.ChEMBL_1444245 (CHEMBL3380184)
IC50<50±n/a nM
Citation Chaudhary, DRobinson, SRomero, DL Recent advances in the discovery of small molecule inhibitors of interleukin-1 receptor-associated kinase 4 (IRAK4) as a therapeutic target for inflammation and oncology disorders. J Med Chem58:96-110 (2015) 
 
Interleukin-1 receptor-associated kinase 4
Name:Interleukin-1 receptor-associated kinase 4
Type:Protein
Mol. Mass.:51519.08
Organism:Homo sapiens (Human)
Description:Q9NWZ3
Residue:460
BDBM50040789
NameBDBM50040789
Synonyms:CHEMBL3353198
TypeSmall organic molecule
Emp. Form.C22H20N6O2S
Mol. Mass.432.498
SMILESNc1ccc(cn1)-c1cccc(n1)C(=O)Nc1ccc2nc(sc2c1)N1CCOCC1