Reaction Details
TargetInterleukin-1 receptor-associated kinase 4
LigandBDBM50040790
Substrate/Competitorn/a
Meas. Tech.ChEMBL_1444243 (CHEMBL3380182)
IC50 1.8±n/a nM
Citation Chaudhary, DRobinson, SRomero, DL Recent advances in the discovery of small molecule inhibitors of interleukin-1 receptor-associated kinase 4 (IRAK4) as a therapeutic target for inflammation and oncology disorders. J Med Chem58:96-110 (2015) 
 
Interleukin-1 receptor-associated kinase 4
Name:Interleukin-1 receptor-associated kinase 4
Type:Protein
Mol. Mass.:51519.08
Organism:Homo sapiens (Human)
Description:Q9NWZ3
Residue:460
BDBM50040790
NameBDBM50040790
Synonyms:CHEMBL3353197 US9242975, 27
TypeSmall organic molecule
Emp. Form.C21H22N6OS2
Mol. Mass.438.569
SMILESCNC(=O)c1nc(sc1C)-c1cnc(Nc2ccc3ncsc3c2)cc1NC(C)C