Reaction Details
TargetInterleukin-1 receptor-associated kinase 4
LigandBDBM50040791
Substrate/Competitorn/a
Meas. Tech.ChEMBL_1444243 (CHEMBL3380182)
IC50 2.8±n/a nM
Citation Chaudhary, DRobinson, SRomero, DL Recent advances in the discovery of small molecule inhibitors of interleukin-1 receptor-associated kinase 4 (IRAK4) as a therapeutic target for inflammation and oncology disorders. J Med Chem58:96-110 (2015) 
 
Interleukin-1 receptor-associated kinase 4
Name:Interleukin-1 receptor-associated kinase 4
Type:Protein
Mol. Mass.:51519.08
Organism:Homo sapiens (Human)
Description:Q9NWZ3
Residue:460
BDBM50040791
NameBDBM50040791
Synonyms:CHEMBL3353196
TypeSmall organic molecule
Emp. Form.C22H23N7O2S2
Mol. Mass.481.594
SMILESCC(C)Nc1cc(Nc2ccc3ncsc3c2)ncc1-c1nnc(s1)C(=O)N1CC[C@H](O)C1