Reaction Details
TargetInterleukin-1 receptor-associated kinase 4
LigandBDBM50040804
Substrate/Competitorn/a
Meas. Tech.ChEMBL_1444239 (CHEMBL3380178)
IC50<100±n/a nM
Citation Chaudhary, DRobinson, SRomero, DL Recent advances in the discovery of small molecule inhibitors of interleukin-1 receptor-associated kinase 4 (IRAK4) as a therapeutic target for inflammation and oncology disorders. J Med Chem58:96-110 (2015) 
 
Interleukin-1 receptor-associated kinase 4
Name:Interleukin-1 receptor-associated kinase 4
Type:Protein
Mol. Mass.:51519.08
Organism:Homo sapiens (Human)
Description:Q9NWZ3
Residue:460
BDBM50040804
NameBDBM50040804
Synonyms:CHEMBL3361256
TypeSmall organic molecule
Emp. Form.C18H22N4S
Mol. Mass.326.459
SMILESCN(C)[C@H]1CC[C@@H](CC1)Nc1ncnc2sc3ccccc3c12