Reaction Details
TargetCannabinoid receptor 2
LigandBDBM50040898
Substrate/Competitorn/a
Meas. Tech.ChEMBL_1444588 (CHEMBL3375407)
EC50>3000±n/a nM
Citation Gianella-Borradori, MChristou, IBataille, CJCross, RLWynne, GMGreaves, DRRussell, AJ Ligand-based virtual screening identifies a family of selective cannabinoid receptor 2 agonists. Bioorg Med Chem23:241-63 (2014) 
 
Cannabinoid receptor 2
Name:Cannabinoid receptor 2
Type:G Protein-Coupled Receptor (GPCR)
Mol. Mass.:39690.94
Organism:Homo sapiens (Human)
Description:P34972
Residue:360
BDBM50040898
NameBDBM50040898
Synonyms:CHEMBL3353819
TypeSmall organic molecule
Emp. Form.C17H10BrN5S
Mol. Mass.396.264
SMILESBrc1cccc2c1[nH]c1nc(SCc3ccccc3C#N)nnc21