Reaction Details
TargetCannabinoid receptor 2
LigandBDBM50040905
Substrate/Competitorn/a
Meas. Tech.ChEMBL_1444588 (CHEMBL3375407)
EC50 1760±n/a nM
Citation Gianella-Borradori, MChristou, IBataille, CJCross, RLWynne, GMGreaves, DRRussell, AJ Ligand-based virtual screening identifies a family of selective cannabinoid receptor 2 agonists. Bioorg Med Chem23:241-63 (2014) 
 
Cannabinoid receptor 2
Name:Cannabinoid receptor 2
Type:G Protein-Coupled Receptor (GPCR)
Mol. Mass.:39690.94
Organism:Homo sapiens (Human)
Description:P34972
Residue:360
BDBM50040905
NameBDBM50040905
Synonyms:CHEMBL3353826
TypeSmall organic molecule
Emp. Form.C21H13N5S2
Mol. Mass.399.491
SMILESN#Cc1ccccc1CSc1nnc2c(n1)[nH]c1cccc(-c3ccsc3)c21