Reaction Details
TargetCannabinoid receptor 2
LigandBDBM50040910
Substrate/Competitorn/a
Meas. Tech.ChEMBL_1444588 (CHEMBL3375407)
EC50 106±n/a nM
Citation Gianella-Borradori, MChristou, IBataille, CJCross, RLWynne, GMGreaves, DRRussell, AJ Ligand-based virtual screening identifies a family of selective cannabinoid receptor 2 agonists. Bioorg Med Chem23:241-63 (2014) 
 
Cannabinoid receptor 2
Name:Cannabinoid receptor 2
Type:G Protein-Coupled Receptor (GPCR)
Mol. Mass.:39690.94
Organism:Homo sapiens (Human)
Description:P34972
Residue:360
BDBM50040910
NameBDBM50040910
Synonyms:CHEMBL3353830
TypeSmall organic molecule
Emp. Form.C21H19N5S
Mol. Mass.373.474
SMILESCCCCn1c2ccccc2c2nnc(SCc3ccccc3C#N)nc12