Reaction Details
TargetCannabinoid receptor 2
LigandBDBM50040933
Substrate/Competitorn/a
Meas. Tech.ChEMBL_1444588 (CHEMBL3375407)
EC50 270±n/a nM
Citation Gianella-Borradori, MChristou, IBataille, CJCross, RLWynne, GMGreaves, DRRussell, AJ Ligand-based virtual screening identifies a family of selective cannabinoid receptor 2 agonists. Bioorg Med Chem23:241-63 (2014) 
 
Cannabinoid receptor 2
Name:Cannabinoid receptor 2
Type:G Protein-Coupled Receptor (GPCR)
Mol. Mass.:39690.94
Organism:Homo sapiens (Human)
Description:P34972
Residue:360
BDBM50040933
NameBDBM50040933
Synonyms:CHEMBL3353832
TypeSmall organic molecule
Emp. Form.C24H23N5S
Mol. Mass.413.538
SMILESN#Cc1ccccc1CSc1nnc2c(n1)n(CC1CCCCC1)c1ccccc21