Reaction Details
TargetCannabinoid receptor 2
LigandBDBM50040940
Substrate/Competitorn/a
Meas. Tech.ChEMBL_1444588 (CHEMBL3375407)
EC50>3000±n/a nM
Citation Gianella-Borradori, MChristou, IBataille, CJCross, RLWynne, GMGreaves, DRRussell, AJ Ligand-based virtual screening identifies a family of selective cannabinoid receptor 2 agonists. Bioorg Med Chem23:241-63 (2014) 
 
Cannabinoid receptor 2
Name:Cannabinoid receptor 2
Type:G Protein-Coupled Receptor (GPCR)
Mol. Mass.:39690.94
Organism:Homo sapiens (Human)
Description:P34972
Residue:360
BDBM50040940
NameBDBM50040940
Synonyms:CHEMBL3353839
TypeSmall organic molecule
Emp. Form.C25H17N5O2S
Mol. Mass.451.5
SMILESO=C(OCc1ccccc1)n1c2ccccc2c2nnc(SCc3ccccc3C#N)nc12