Reaction Details
TargetCannabinoid receptor 2
LigandBDBM50040946
Substrate/Competitorn/a
Meas. Tech.ChEMBL_1444588 (CHEMBL3375407)
EC50 42±n/a nM
Citation Gianella-Borradori, MChristou, IBataille, CJCross, RLWynne, GMGreaves, DRRussell, AJ Ligand-based virtual screening identifies a family of selective cannabinoid receptor 2 agonists. Bioorg Med Chem23:241-63 (2014) 
 
Cannabinoid receptor 2
Name:Cannabinoid receptor 2
Type:G Protein-Coupled Receptor (GPCR)
Mol. Mass.:39690.94
Organism:Homo sapiens (Human)
Description:P34972
Residue:360
BDBM50040946
NameBDBM50040946
Synonyms:CHEMBL3354397
TypeSmall organic molecule
Emp. Form.C23H19N5O3S
Mol. Mass.445.494
SMILESCOC(=O)CCCC(=O)n1c2ccccc2c2nnc(SCc3ccccc3C#N)nc12